{"text_format":"1","workbook":"xlsx","n_sheets":6,"sheets":["Introduction","Input","Guidance","Working","Text","Output"],"not_rendered":{"charts":1,"images":4,"macros":1,"external_links":0,"defined_names":3,"comments":1,"pivot_tables":0},"unopened":[],"bounds":{"document_bytes":16777216,"sheet_cells":100000,"rows_first":2000,"rows_last":500,"rows_between":2000,"halvings":0,"cell_chars":16384,"cell_head_chars":4096},"cells_cut":0,"cells_raw":0,"read":"whole","date_system":"1900"}

{"sheet":"Introduction","index":0,"n_rows":12,"n_cols":2,"rows_kept":12,"cut":false,"hidden":false,"merged":[]}
[]
[]
[null,{"$f":"\"Climate Change Impact Assessment Tool (v\"&Text!C8&\")\"","v":"Climate Change Impact Assessment Tool (v1.36)"}]
[null,"Developed by Chesterfield Borough Council 2021 "]
[null,"Chesterfield Borough Council (CBC) is taking the problem of climate change very seriously, and declared a climate emergency in July 2019, with the stated goal of becoming a carbon neutral organisation by 2030. As part of our response to climate change, the council committed to introduce climate change impact assessments for all reports where decisions are made. (Climate Change Action Plan item 34). This means that if you develop or change a policy, project, service, function, or strategy, you need to identify the impact of the activity regarding the climate. Our preferred method for doing this is by conducting a Climate Change Impact Assessment (CCIA). This is similar to a risk assessment, or an equalities impact assessment: it is a structured report showing:\n\n•\tWhat effects our activities have on the climate (mainly through our emissions of greenhouse gasses) and what we are doing to reduce these effects \n•\tWhat impacts a changing climate may have on our services and functions and what actions we will take to become more resilient and less vulnerable.\n\nFor further information on how to use this tool, see the guidance notes and video tutorials."]
[null,"Guidance notes and video tutorials for Climate Change Impact Assessment tool"]
[]
[null,"This climate change impact assessment tool has been developed by Chesterfield Borough Council (CBC) for internal use. While CBC are happy to share this tool free of charge, we make no assertions about its usefulness, reliability, or fitness for purpose. This tool is supplied \"as is\" with no warranty of any kind under a Creative Commons attributional, \nnon-commercial licence."]
[null,"Attribution-NonCommercial 4.0 International"]
[]
[null,"It would be helpful to us if you could send us a copy of any revised or altered version you create and let us know how you are planning to use it. This helps us to gauge the impact of our work and justify similar projects. Please send information via email to:"]
[null,"climate@chesterfield.gov.uk"]

{"sheet":"Input","index":1,"n_rows":57,"n_cols":5,"rows_kept":57,"cut":false,"hidden":false,"merged":[]}
[]
[null,{"$f":"\"Climate Change Impact Assessment Tool (v\"&Text!C8&\")\"","v":"Climate Change Impact Assessment Tool (v1.36)"}]
[null,"Developed by Chesterfield Borough Council 2021 "]
[]
[null,"Report Name","Report Name"]
[null,"Report date","Report Date"]
[null,"Report author","Your name"]
[null,"Project Notes","Use this space for a brief overview of the project and any extra notes on things that aren't covered below. "]
[null,"Export filename",{"$f":"Text!C12","v":"Report Name CCIA Report Date"},".png"]
[]
[null,"Category","Impact","Notes / justification for score / existing work\n(see guidance sheet or attached notes for more information)","Score\n(-5 to +5)"]
[null,"Buildings","Building construction"]
[null,"Buildings","Building use"]
[null,"Buildings","Green / blue infrastructure"]
[null,"Buildings"]
[null,"Business","Developing green businesses"]
[null,"Business","Marketable skills & training"]
[null,"Business","Sustainability in business"]
[null,"Business"]
[null,"Energy","Local renewable generation capacity"]
{"$rows_left_out":38}
{"sheet":"Guidance","index":2,"n_rows":34,"n_cols":4,"rows_kept":34,"cut":false,"hidden":false,"merged":[]}
[]
[null,"Category","Impact","Notes & examples"]
[null,"Buildings","Building construction","How is the building constructed? Positive impacts would include retrofitting existing buildings rather than demolition and replacement, construction using low carbon materials (e.g. low concrete, additional timber) to high standard (BREEAM [Building Research Establishment Environmental Assessment Method], Passivhaus etc.) the inclusion of high grade insulation, low carbon heating, and microgeneration technologies. Negative impacts would generally be business as usual construction techniques. This is distinct from the building use impact in that it is about the fabric of the building rather than how the building is used. If it is not clear whether an impact should be in this category or the building use category below, simply choose one, and make sure you don’t report an item in both categories."]
[null,"Buildings","Building use","How is the building used? Positive impacts would include encouragement of low-carbon living and travel. This could be provision of bicycle storage, water fountains, recycling bins, automatic lighting, or passive cooling etc. Negative impacts would include removal or omission of one or more of these modifications, or alterations that discourage low carbon use (removal of cycle storage for example). If it is not clear whether an impact should be in this category or the construction category above, simply choose one, and make sure you don’t report an item in both categories."]
[null,"Buildings","Green / blue infrastructure","This includes changes to the value of green / blue infrastructure in the built environment (excluding wider land use which is included below) . Impacts may include habitat creation within a building (nesting boxes or a green roof for example) the introduction of street trees or sustainable drainage from a development. These are measures which are implemented with good building design but are not necessarily part of the building itself. Negative impacts would include habitat loss, impermeable drainage surfaces etc."]
[null,"Business","Developing green businesses","Does the activity explicitly support the development of green businesses? This impact covers businesses which are focussed on delivering green technologies, research, services etc. NOT simply an existing business implementing incremental changes to established processes and supply chains (which would be counted under sustainability in business below). Examples might be development of a new business installing solar panels, providing energy audits, or manufacturing EV charging points. Negative scores would reflect adverse effects on these businesses"]
[null,"Business","Marketable skills & training","Does this activity provide training to individuals and businesses in improving their climate change performance, or in developing marketable green skills? For example, this might include land management, waste reduction, low carbon construction, microgeneration technologies etc. Negative effects are unlikely in this category, but could include closure of a local training provider"]
[null,"Business","Sustainability in business","Does this activity support businesses in applying best practice and sustainable solutions in their existing business model and supply chains? This must be a quantifiable shift in business practice to reduce climate impact (rather than a high score simply because the business is involved in some form of low carbon technology – this would be included under the developing green businesses heading) . Examples of this might be successful application to a new certification scheme (FSC, PEFC, ISO 14001 etc.) a switch to a less carbon intensive manufacturing process, successful applications to government decarbonisation schemes etc."]
[null,"Energy","Local renewable generation capacity","Does the activity include changes to local capacity for renewable electricity heat generation? This might include solar PV panels, heat pumps, biomass boilers, wind turbines, micro-hydro etc. Negative effects would include decommissioning of local capacity, e.g. building on an existing solar farm."]
[null,"Energy","Reducing energy demand","Does the activity change overall energy demand? This might include installation of more efficient systems, or management to allow reduced heating or lighting energy demand. A negative score would represent a net increase in heating or lighting energy demand."]
[null,"Energy","Switching away from fossil fuels","Does this activity involve an increase or decrease in static fossil fuel technologies (transport is covered later). For example, replacement of an existing gas boiler with a heat pump of an equivalent rating would be a positive score. Installation of new fossil fuel systems represents a negative score in this category (even if they are more efficient than existing systems)"]
[null,"Influence","Communication & engagement","Does this activity increase awareness of climate change, and our actions to address climate change issues? Does it challenge climate change disinformation, and can we back up what we say with good quality published science? Conversely, is this activity embarrassing from a climate point of view? Is there a climate cost to a positive action that we are delivering for other reasons? Is this reasonable and justifiable?"]
[null,"Influence","Wider influence","Does this activity result in us gaining authority on a climate change issue, could we be a clear example to other local authorities, are we leading on this? A negative outcome would be us missing opportunities, failing to engage with the wider conversation, or re-inventing existing work.  "]
[null,"Influence","Working with communities","Does this activity help build awareness, willingness, and skills in our communities to address climate change? Does it have a cost or benefit in terms of our relationships with community groups?"]
[null,"Influence","Working with partners","Are we taking steps in this activity to ensure that we are working with partners with similar values to ours in relation to climate change? Is this activity expanding or limiting our work with partners more generally?"]
[null,"Internal resources","Material / infrastructure requirement","Does this activity result in us using more or less of our existing infrastructure, supplies and council resources? Will this have an indirect impact on the climate change impact of other services? Are we taking the appropriate steps to ensure that we are using the minimum necessary resource, and that it is at the highest possible environmental standard? Is there a clear constraint stopping us from doing more?"]
[null,"Internal resources","Staff time requirement","Council emissions are directly influenced by the amount of time members of staff have to work on an activity - does this activity require more staff time or less? What are the indirect effects? Does this mean that another project will have more or less resources?"]
[null,"Internal resources","Staff travel requirement","Does this activity mean that staff will need to travel more or less? Can this be reduced? Can we modify the project to change the mode of transport (public transport, cycling, walking, remote working etc.) If not, why not?"]
[null,"Internal resources","External funding","Are we able to leverage additional support for the activity from external funders? Does this mean we can achieve more than we could originally? Would support for this project preclude support for something else? How can we use external funding to help us reach our climate goals?"]
[null,"Land use","Carbon storage","Does this project result in a net increase or decrease in land carbon storage? This is likely to be directly correlated with the amount of timber (or mature trees) on the site, but may also be affected by peat formation, wetlands, or peat use as a horticultural medium. Remember that trees take a long time to grow (!) so simply replacing a mature tree with a newly planted one would still result in a loss of carbon."]
{"$rows_left_out":15}
{"sheet":"Working","index":3,"n_rows":53,"n_cols":8,"rows_kept":53,"cut":false,"hidden":true,"merged":[]}
[]
[null,"Category","Sum","n impacts","n blanks","Value","Formatted Value","Formatted Label"]
[null,{"$f":"_xlfn.UNIQUE(Input!$B$12:$B$978,FALSE,FALSE)","v":"Buildings"},{"$f":"IF(ISBLANK(B3)=TRUE,\"\",SUMIFS(Input!E:E,Input!B:B,\"=\"&B3,Input!E:E,\"<>#N/A\"))","v":0},{"$f":"IF(ISBLANK(B3)=TRUE,\"\",COUNTIFS(Input!B:B,\"=\"&B3))","v":4},{"$f":"IF(ISBLANK(B3)=TRUE,\"\",COUNTIFS(Input!B:B,\"=\"&B3,Input!E:E,\"=\"&\"\"))","v":4},{"$f":"IF(OR(AND(D3=E3,B3=\"Other\"),B3=0,B3=\"\"),NA(),C3)","v":0},{"$f":"IF(AND(D3=E3,F3=0),\"\",\"(\"&TEXT(F3,\"+##,##0;-##,##0;↓↑ ##,##0\")&\")\")","v":""},{"$f":"B3&CHAR(10)&G3","v":"Buildings\n"}]
[null,"Business",{"$f":"IF(ISBLANK(B4)=TRUE,\"\",SUMIFS(Input!E:E,Input!B:B,\"=\"&B4,Input!E:E,\"<>#N/A\"))","v":0},{"$f":"IF(ISBLANK(B4)=TRUE,\"\",COUNTIFS(Input!B:B,\"=\"&B4))","v":4},{"$f":"IF(ISBLANK(B4)=TRUE,\"\",COUNTIFS(Input!B:B,\"=\"&B4,Input!E:E,\"=\"&\"\"))","v":4},0,{"$f":"IF(AND(D4=E4,F4=0),\"\",\"(\"&TEXT(F4,\"+##,##0;-##,##0;↓↑ ##,##0\")&\")\")","v":""},"Business\n"]
[null,"Energy",{"$f":"IF(ISBLANK(B5)=TRUE,\"\",SUMIFS(Input!E:E,Input!B:B,\"=\"&B5,Input!E:E,\"<>#N/A\"))","v":0},{"$f":"IF(ISBLANK(B5)=TRUE,\"\",COUNTIFS(Input!B:B,\"=\"&B5))","v":4},{"$f":"IF(ISBLANK(B5)=TRUE,\"\",COUNTIFS(Input!B:B,\"=\"&B5,Input!E:E,\"=\"&\"\"))","v":4},0,"","Energy\n"]
[null,"Influence",{"$f":"IF(ISBLANK(B6)=TRUE,\"\",SUMIFS(Input!E:E,Input!B:B,\"=\"&B6,Input!E:E,\"<>#N/A\"))","v":0},{"$f":"IF(ISBLANK(B6)=TRUE,\"\",COUNTIFS(Input!B:B,\"=\"&B6))","v":5},{"$f":"IF(ISBLANK(B6)=TRUE,\"\",COUNTIFS(Input!B:B,\"=\"&B6,Input!E:E,\"=\"&\"\"))","v":5},0,"","Influence\n"]
[null,"Internal Resources",{"$f":"IF(ISBLANK(B7)=TRUE,\"\",SUMIFS(Input!E:E,Input!B:B,\"=\"&B7,Input!E:E,\"<>#N/A\"))","v":0},{"$f":"IF(ISBLANK(B7)=TRUE,\"\",COUNTIFS(Input!B:B,\"=\"&B7))","v":5},{"$f":"IF(ISBLANK(B7)=TRUE,\"\",COUNTIFS(Input!B:B,\"=\"&B7,Input!E:E,\"=\"&\"\"))","v":5},0,"","Internal Resources\n"]
[null,"Land use",{"$f":"IF(ISBLANK(B8)=TRUE,\"\",SUMIFS(Input!E:E,Input!B:B,\"=\"&B8,Input!E:E,\"<>#N/A\"))","v":0},{"$f":"IF(ISBLANK(B8)=TRUE,\"\",COUNTIFS(Input!B:B,\"=\"&B8))","v":4},{"$f":"IF(ISBLANK(B8)=TRUE,\"\",COUNTIFS(Input!B:B,\"=\"&B8,Input!E:E,\"=\"&\"\"))","v":4},0,"","Land use\n"]
[null,"Goods & Services",{"$f":"IF(ISBLANK(B9)=TRUE,\"\",SUMIFS(Input!E:E,Input!B:B,\"=\"&B9,Input!E:E,\"<>#N/A\"))","v":0},{"$f":"IF(ISBLANK(B9)=TRUE,\"\",COUNTIFS(Input!B:B,\"=\"&B9))","v":5},{"$f":"IF(ISBLANK(B9)=TRUE,\"\",COUNTIFS(Input!B:B,\"=\"&B9,Input!E:E,\"=\"&\"\"))","v":5},0,"","Goods & Services\n"]
[null,"Transport",{"$f":"IF(ISBLANK(B10)=TRUE,\"\",SUMIFS(Input!E:E,Input!B:B,\"=\"&B10,Input!E:E,\"<>#N/A\"))","v":0},{"$f":"IF(ISBLANK(B10)=TRUE,\"\",COUNTIFS(Input!B:B,\"=\"&B10))","v":4},{"$f":"IF(ISBLANK(B10)=TRUE,\"\",COUNTIFS(Input!B:B,\"=\"&B10,Input!E:E,\"=\"&\"\"))","v":4},0,"","Transport\n"]
[null,"Waste",{"$f":"IF(ISBLANK(B11)=TRUE,\"\",SUMIFS(Input!E:E,Input!B:B,\"=\"&B11,Input!E:E,\"<>#N/A\"))","v":0},{"$f":"IF(ISBLANK(B11)=TRUE,\"\",COUNTIFS(Input!B:B,\"=\"&B11))","v":3},{"$f":"IF(ISBLANK(B11)=TRUE,\"\",COUNTIFS(Input!B:B,\"=\"&B11,Input!E:E,\"=\"&\"\"))","v":3},0,"","Waste\n"]
[null,"Adaptation",{"$f":"IF(ISBLANK(B12)=TRUE,\"\",SUMIFS(Input!E:E,Input!B:B,\"=\"&B12,Input!E:E,\"<>#N/A\"))","v":0},{"$f":"IF(ISBLANK(B12)=TRUE,\"\",COUNTIFS(Input!B:B,\"=\"&B12))","v":4},{"$f":"IF(ISBLANK(B12)=TRUE,\"\",COUNTIFS(Input!B:B,\"=\"&B12,Input!E:E,\"=\"&\"\"))","v":4},0,"","Adaptation\n"]
[null,"Other",{"$f":"IF(ISBLANK(B13)=TRUE,\"\",SUMIFS(Input!E:E,Input!B:B,\"=\"&B13,Input!E:E,\"<>#N/A\"))","v":0},{"$f":"IF(ISBLANK(B13)=TRUE,\"\",COUNTIFS(Input!B:B,\"=\"&B13))","v":4},{"$f":"IF(ISBLANK(B13)=TRUE,\"\",COUNTIFS(Input!B:B,\"=\"&B13,Input!E:E,\"=\"&\"\"))","v":4},{"$error":"#N/A"},{"$error":"#N/A"},{"$error":"#N/A"}]
[null,0,{"$f":"IF(ISBLANK(B14)=TRUE,\"\",SUMIFS(Input!E:E,Input!B:B,\"=\"&B14,Input!E:E,\"<>#N/A\"))","v":0},{"$f":"IF(ISBLANK(B14)=TRUE,\"\",COUNTIFS(Input!B:B,\"=\"&B14))","v":0},{"$f":"IF(ISBLANK(B14)=TRUE,\"\",COUNTIFS(Input!B:B,\"=\"&B14,Input!E:E,\"=\"&\"\"))","v":0},{"$error":"#N/A"},{"$error":"#N/A"},{"$error":"#N/A"}]
[null,null,{"$f":"IF(ISBLANK(B15)=TRUE,\"\",SUMIFS(Input!E:E,Input!B:B,\"=\"&B15,Input!E:E,\"<>#N/A\"))","v":""},{"$f":"IF(ISBLANK(B15)=TRUE,\"\",COUNTIFS(Input!B:B,\"=\"&B15))","v":""},{"$f":"IF(ISBLANK(B15)=TRUE,\"\",COUNTIFS(Input!B:B,\"=\"&B15,Input!E:E,\"=\"&\"\"))","v":""},{"$error":"#N/A"},{"$error":"#N/A"},{"$error":"#N/A"}]
[null,null,{"$f":"IF(ISBLANK(B16)=TRUE,\"\",SUMIFS(Input!E:E,Input!B:B,\"=\"&B16,Input!E:E,\"<>#N/A\"))","v":""},{"$f":"IF(ISBLANK(B16)=TRUE,\"\",COUNTIFS(Input!B:B,\"=\"&B16))","v":""},{"$f":"IF(ISBLANK(B16)=TRUE,\"\",COUNTIFS(Input!B:B,\"=\"&B16,Input!E:E,\"=\"&\"\"))","v":""},{"$error":"#N/A"},{"$error":"#N/A"},{"$error":"#N/A"}]
[null,null,{"$f":"IF(ISBLANK(B17)=TRUE,\"\",SUMIFS(Input!E:E,Input!B:B,\"=\"&B17,Input!E:E,\"<>#N/A\"))","v":""},{"$f":"IF(ISBLANK(B17)=TRUE,\"\",COUNTIFS(Input!B:B,\"=\"&B17))","v":""},{"$f":"IF(ISBLANK(B17)=TRUE,\"\",COUNTIFS(Input!B:B,\"=\"&B17,Input!E:E,\"=\"&\"\"))","v":""},{"$error":"#N/A"},{"$error":"#N/A"},{"$error":"#N/A"}]
[null,null,{"$f":"IF(ISBLANK(B18)=TRUE,\"\",SUMIFS(Input!E:E,Input!B:B,\"=\"&B18,Input!E:E,\"<>#N/A\"))","v":""},{"$f":"IF(ISBLANK(B18)=TRUE,\"\",COUNTIFS(Input!B:B,\"=\"&B18))","v":""},{"$f":"IF(ISBLANK(B18)=TRUE,\"\",COUNTIFS(Input!B:B,\"=\"&B18,Input!E:E,\"=\"&\"\"))","v":""},{"$error":"#N/A"},{"$error":"#N/A"},{"$error":"#N/A"}]
[null,null,{"$f":"IF(ISBLANK(B19)=TRUE,\"\",SUMIFS(Input!E:E,Input!B:B,\"=\"&B19,Input!E:E,\"<>#N/A\"))","v":""},{"$f":"IF(ISBLANK(B19)=TRUE,\"\",COUNTIFS(Input!B:B,\"=\"&B19))","v":""},{"$f":"IF(ISBLANK(B19)=TRUE,\"\",COUNTIFS(Input!B:B,\"=\"&B19,Input!E:E,\"=\"&\"\"))","v":""},{"$error":"#N/A"},{"$error":"#N/A"},{"$error":"#N/A"}]
[null,null,{"$f":"IF(ISBLANK(B20)=TRUE,\"\",SUMIFS(Input!E:E,Input!B:B,\"=\"&B20,Input!E:E,\"<>#N/A\"))","v":""},{"$f":"IF(ISBLANK(B20)=TRUE,\"\",COUNTIFS(Input!B:B,\"=\"&B20))","v":""},{"$f":"IF(ISBLANK(B20)=TRUE,\"\",COUNTIFS(Input!B:B,\"=\"&B20,Input!E:E,\"=\"&\"\"))","v":""},{"$error":"#N/A"},{"$error":"#N/A"},{"$error":"#N/A"}]
{"$rows_left_out":34}
{"sheet":"Text","index":4,"n_rows":67,"n_cols":7,"rows_kept":67,"cut":false,"hidden":true,"merged":[[15,1,66,1],[3,4,3,5]]}
[]
[null,"Target 1",{"$f":"DATE(2030,1,1)","v":"2030-01-01"},null,"Only edit the light blue boxes by hand (everything else is calculated)"]
[null,"Target 2","2050-01-01"]
[null,"Today (code)",{"$f":"TODAY()","v":"2021-12-23"},null,"Rag rating hex colours",null,"< for guidance only, all colour fomatting on the chart is carried out using conditional formatting and VBA"]
[null,"Today (text)",{"$f":"CONCATENATE(TEXT(TODAY(), \"dd/mm/yy\"))","v":"23/12/21"},null,"Red","E03A3E"]
[null,"Time to target 1",{"$f":"DATEDIF($C$4,C2,\"y\") &\" years and \"&DATEDIF($C$4,C2,\"ym\") &\" months\"","v":"8 years and 0 months"},null,"Amber","FDB827"]
[null,"Time to target 2",{"$f":"DATEDIF($C$4,C3,\"y\") &\" years, \"&DATEDIF($C$4,C3,\"ym\") &\" months, and \" &DATEDIF($C$4,C3,\"md\") &\" days\"","v":"28 years, 0 months, and 9 days"},null,"Neutral","b8b8b8"]
[null,"Version",1.36,null,"Green","61BB46"]
[null,"Text label",{"$f":"\"Chesterfield Borough Council has committed to being a carbon neutral organisation by 2030 (\"&Text!C6&\" away).\"","v":"Chesterfield Borough Council has committed to being a carbon neutral organisation by 2030 (8 years and 0 months away)."},null,"Really_Green","406F31"]
[null,"Text label 2",{"$f":"\"Generated \"&C5&\" v\"&Text!C8","v":"Generated 23/12/21 v1.36"}]
[null,"Centre index",{"$f":"SUMIF(Working!C:C,\"<>#N/A\")","v":0}]
[null,"default filename",{"$f":"IF(Input!C6=\"\",Input!C5&\" CCIA \"&TEXT(C4,\"dd.mm.yy\"),Input!C5&\" CCIA \"&TEXT(Input!C6,\"dd.mm.yyyy\"))","v":"Report Name CCIA Report Date"}]
[null,"output filename",{"$f":"IF(Input!C9 = C12, Text!C12,Input!C9)","v":"Report Name CCIA Report Date"}]
[null,"alt text",{"$f":"_xlfn.CONCAT(C16:C67)","v":"The infographic shows the relative costs and benefits of the decision on 10 different categories with respect to the climate: Buildings, no effect. Business, no effect. Energy, no effect. Influence, no effect. Internal Resources, no effect. Land use, no effect. Goods & Services, no effect. Transport, no effect. Waste, no effect. Adaptation, no effect. "}]
[null,"Number of categories",{"$f":"SUMIF(Output!D:D,\"<>#N/A\")","v":10}]
[null,"Alt text content",{"$f":"\"The infographic shows the relative costs and benefits of the decision on \"&C15&\" different categories with respect to the climate: \"","v":"The infographic shows the relative costs and benefits of the decision on 10 different categories with respect to the climate: "},"Alt text working"]
[null,null,{"$f":"IFERROR(IF(F17<>\"#N/A\",D17&E17&\". \",\"\"),\"\")","v":"Buildings, no effect. "},{"$f":"Working!B3&\",\"","v":"Buildings,"},{"$f":"IFERROR(IF(AND(Working!D3=Working!E3,Working!F3=0),\" no effect\",F17),\"\")","v":" no effect"},{"$f":"IF(Working!F3=0,\" no net effect\",IF(Working!F3<0,\" minus \"&ABS(Working!F3),\" plus \"&ABS(Working!F3)))","v":" no net effect"}]
[null,null,{"$f":"IFERROR(IF(F18<>\"#N/A\",D18&E18&\". \",\"\"),\"\")","v":"Business, no effect. "},{"$f":"Working!B4&\",\"","v":"Business,"},{"$f":"IFERROR(IF(AND(Working!D4=Working!E4,Working!F4=0),\" no effect\",F18),\"\")","v":" no effect"},{"$f":"IF(Working!F4=0,\" no net effect\",IF(Working!F4<0,\" minus \"&ABS(Working!F4),\" plus \"&ABS(Working!F4)))","v":" no net effect"}]
[null,null,"Energy, no effect. ",{"$f":"Working!B5&\",\"","v":"Energy,"},{"$f":"IFERROR(IF(AND(Working!D5=Working!E5,Working!F5=0),\" no effect\",F19),\"\")","v":" no effect"},{"$f":"IF(Working!F5=0,\" no net effect\",IF(Working!F5<0,\" minus \"&ABS(Working!F5),\" plus \"&ABS(Working!F5)))","v":" no net effect"}]
[null,null,{"$f":"IFERROR(IF(F20<>\"#N/A\",D20&E20&\". \",\"\"),\"\")","v":"Influence, no effect. "},{"$f":"Working!B6&\",\"","v":"Influence,"},{"$f":"IFERROR(IF(AND(Working!D6=Working!E6,Working!F6=0),\" no effect\",F20),\"\")","v":" no effect"},{"$f":"IF(Working!F6=0,\" no net effect\",IF(Working!F6<0,\" minus \"&ABS(Working!F6),\" plus \"&ABS(Working!F6)))","v":" no net effect"}]
{"$rows_left_out":48}
{"sheet":"Output","index":5,"n_rows":54,"n_cols":10,"rows_kept":54,"cut":false,"hidden":true,"merged":[]}
[]
[]
[null,null,"Label","Used","Value & colour"]
[null,null,{"$f":"Working!H3","v":"Buildings\n"},{"$f":"IF(C4<>\"\",1,NA())","v":1},{"$f":"Working!F3","v":0},"< conditional formatting is transferred to chart"]
[null,null,{"$f":"Working!H4","v":"Business\n"},{"$f":"IF(C5<>\"\",1,NA())","v":1},{"$f":"Working!F4","v":0}]
[null,null,{"$f":"Working!H5","v":"Energy\n"},1,{"$f":"Working!F5","v":0}]
[null,null,{"$f":"Working!H6","v":"Influence\n"},1,{"$f":"Working!F6","v":0}]
[null,null,{"$f":"Working!H7","v":"Internal Resources\n"},1,{"$f":"Working!F7","v":0}]
[null,null,{"$f":"Working!H8","v":"Land use\n"},1,{"$f":"Working!F8","v":0}]
[null,null,{"$f":"Working!H9","v":"Goods & Services\n"},1,{"$f":"Working!F9","v":0}]
[null,null,{"$f":"Working!H10","v":"Transport\n"},1,{"$f":"Working!F10","v":0}]
[null,null,{"$f":"Working!H11","v":"Waste\n"},1,{"$f":"Working!F11","v":0}]
[null,null,{"$f":"Working!H12","v":"Adaptation\n"},1,{"$f":"Working!F12","v":0}]
[null,null,{"$f":"Working!H13","v":{"$error":"#N/A"}},{"$error":"#N/A"},{"$f":"Working!F13","v":{"$error":"#N/A"}}]
[null,null,{"$f":"Working!H14","v":{"$error":"#N/A"}},{"$error":"#N/A"},{"$f":"Working!F14","v":{"$error":"#N/A"}}]
[null,null,{"$f":"Working!H15","v":{"$error":"#N/A"}},{"$error":"#N/A"},{"$f":"Working!F15","v":{"$error":"#N/A"}}]
[null,null,{"$f":"Working!H16","v":{"$error":"#N/A"}},{"$error":"#N/A"},{"$f":"Working!F16","v":{"$error":"#N/A"}}]
[null,null,{"$f":"Working!H17","v":{"$error":"#N/A"}},{"$error":"#N/A"},{"$f":"Working!F17","v":{"$error":"#N/A"}}]
[null,null,{"$f":"Working!H18","v":{"$error":"#N/A"}},{"$error":"#N/A"},{"$f":"Working!F18","v":{"$error":"#N/A"}}]
[null,null,{"$f":"Working!H19","v":{"$error":"#N/A"}},{"$error":"#N/A"},{"$f":"Working!F19","v":{"$error":"#N/A"}}]
{"$rows_left_out":34}